{"text_format":"1","workbook":"xlsx","n_sheets":4,"sheets":["活動記録","活動記録　記入例","活動実施項目一覧表","【選択肢】"],"not_rendered":{"charts":0,"images":0,"macros":1,"external_links":1,"defined_names":39,"comments":0,"pivot_tables":0},"unopened":[],"bounds":{"document_bytes":16777216,"sheet_cells":100000,"rows_first":2000,"rows_last":500,"rows_between":2000,"halvings":0,"cell_chars":16384,"cell_head_chars":4096},"cells_cut":0,"cells_raw":0,"read":"whole","date_system":"1900"}

{"sheet":"活動記録","index":0,"n_rows":113,"n_cols":18,"rows_kept":113,"cut":false,"hidden":false,"merged":[[2,6,2,14],[4,1,4,15],[5,1,5,2],[5,3,5,5],[5,6,7,11],[5,12,5,14],[5,15,7,15],[110,1,110,2],[111,1,111,2],[112,1,112,2],[108,1,108,15],[5,16,5,17],[6,1,7,1],[6,2,7,2],[6,3,7,3],[6,4,7,4],[6,5,7,5],[6,12,7,12],[6,13,7,13],[6,14,7,14],[6,16,7,16],[6,17,7,17],[114,1,116,1],[114,14,116,14],[114,15,116,15],[117,1,119,1],[117,14,119,14],[117,15,119,15],[120,1,122,1],[120,14,122,14],[120,15,122,15],[123,1,125,1],[123,14,125,14],[123,15,125,15],[126,1,128,1],[126,14,128,14],[126,15,128,15],[129,1,131,1],[129,14,131,14],[129,15,131,15],[132,1,134,1],[132,14,134,14],[132,15,134,15],[135,1,137,1],[135,14,137,14],[135,15,137,15],[138,1,140,1],[138,14,140,14],[138,15,140,15],[141,1,143,1],[141,14,143,14],[141,15,143,15],[144,1,146,1],[144,14,146,14],[144,15,146,15],[147,1,149,1],[147,14,149,14],[147,15,149,15]]}
[null,"（様式第１－６号）",null,null,null,null,null,null,null,null,null,null,null,null,null,"農林水産省様式"]
[null,"【活動組織から市町村に提出するもの】",null,null,null,null,null,null,null,null,null,null,null,null,null,"組織名："]
[null,null,null,null,null,"令和　","年度　多面的機能支払交付金　活動記録"]
[null,"★「実施時間」には休憩時間を含めず、実働時間を記入してください。"]
[null,"★「活動項目番号」欄には、実施要領別記1-2の国が定める活動指針における活動項目の番号及び要領第1の２の(1)に基づき都道府県が定める要綱基本方針において追加された活\n　動項目の番号を記入します。その他、事務処理は200番、会議等は300番を記入します。\n　同一日に複数の活動を行った場合は、該当する全ての活動項目番号を左詰めで一行に記入してください。番号欄が足りない場合は、複数行に分けて記入してください。"]
[null,"活動実施日及び活動時間",null,"活動参加人数",null,null,"活動項目番号（左詰め）",null,null,null,null,null,"活動内容",null,null,"備考\n（具体的な活動内容を記入）","様式欄外（参考）"]
[null,"日付","活動時間","農業者","農業者\n以外","総参加\n人数",null,null,null,null,null,null,"支払区分","活動区分","活動項目",null,"直営施工した場合は○","活動支援班による活動の場合は○"]
[]
[null,null,null,null,null,{"$f":"SUM(D9+E9)","v":0},null,null,null,null,null,null,{"$f":"IF(G9=\"\",\"\",(IFERROR(VLOOKUP($G9,【選択肢】!$Q$3:$U$90,2,),\" \")&IF(H9=\"\",\"\",\",\"&IFERROR(VLOOKUP($H9,【選択肢】!$Q$3:$U$90,2,),\" \")&IF(I9=\"\",\"\",\",\"&IFERROR(VLOOKUP($I9,【選択肢】!$Q$3:$U$90,2,),\" \")&IF(J9=\"\",\"\",\",\"&IFERROR(VLOOKUP($J9,【選択肢】!$Q$3:$U$90,2,),\" \")&IF(K9=\"\",\"\",\",\"&IFERROR(VLOOKUP($K9,【選択肢】!$Q$3:$U$90,2,),\" \")&IF(L9=\"\",\"\",\",\"&IFERROR(VLOOKUP($L9,【選択肢】!$Q$3:$U$90,2,),\" \"))))))))","v":""},{"$f":"IF(G9=\"\",\"\",(IFERROR(VLOOKUP($G9,[1]【選択肢】!$Q$3:$U$90,4,),\" \")&IF(H9=\"\",\"\",\",\"&IFERROR(VLOOKUP($H9,[1]【選択肢】!$Q$3:$U$90,4,),\" \")&IF(I9=\"\",\"\",\",\"&IFERROR(VLOOKUP($I9,[1]【選択肢】!$Q$3:$U$90,4,),\" \")&IF(J9=\"\",\"\",\",\"&IFERROR(VLOOKUP($J9,[1]【選択肢】!$Q$3:$U$90,4,),\" \")&IF(K9=\"\",\"\",\",\"&IFERROR(VLOOKUP($K9,[1]【選択肢】!$Q$3:$U$90,4,),\" \")&IF(L9=\"\",\"\",\",\"&IFERROR(VLOOKUP($L9,[1]【選択肢】!$Q$3:$U$90,4,),\" \"))))))))","v":""},{"$f":"IF(G9=\"\",\"\",(IFERROR(VLOOKUP($G9,【選択肢】!$Q$3:$U$90,5,),\" \")&IF(H9=\"\",\"\",\",\"&IFERROR(VLOOKUP($H9,【選択肢】!$Q$3:$U$90,5,),\" \")&IF(I9=\"\",\"\",\",\"&IFERROR(VLOOKUP($I9,【選択肢】!$Q$3:$U$90,5,),\" \")&IF(J9=\"\",\"\",\",\"&IFERROR(VLOOKUP($J9,【選択肢】!$Q$3:$U$90,5,),\" \")&IF(K9=\"\",\"\",\",\"&IFERROR(VLOOKUP($K9,【選択肢】!$Q$3:$U$90,5,),\" \")&IF(L9=\"\",\"\",\",\"&IFERROR(VLOOKUP($L9,【選択肢】!$Q$3:$U$90,5,),\" \"))))))))","v":""}]
[null,null,null,null,null,0,null,null,null,null,null,null,{"$f":"IF(G10=\"\",\"\",(IFERROR(VLOOKUP($G10,【選択肢】!$Q$3:$U$90,2,),\" \")&IF(H10=\"\",\"\",\",\"&IFERROR(VLOOKUP($H10,【選択肢】!$Q$3:$U$90,2,),\" \")&IF(I10=\"\",\"\",\",\"&IFERROR(VLOOKUP($I10,【選択肢】!$Q$3:$U$90,2,),\" \")&IF(J10=\"\",\"\",\",\"&IFERROR(VLOOKUP($J10,【選択肢】!$Q$3:$U$90,2,),\" \")&IF(K10=\"\",\"\",\",\"&IFERROR(VLOOKUP($K10,【選択肢】!$Q$3:$U$90,2,),\" \")&IF(L10=\"\",\"\",\",\"&IFERROR(VLOOKUP($L10,【選択肢】!$Q$3:$U$90,2,),\" \"))))))))","v":""},{"$f":"IF(G10=\"\",\"\",(IFERROR(VLOOKUP($G10,[1]【選択肢】!$Q$3:$U$90,4,),\" \")&IF(H10=\"\",\"\",\",\"&IFERROR(VLOOKUP($H10,[1]【選択肢】!$Q$3:$U$90,4,),\" \")&IF(I10=\"\",\"\",\",\"&IFERROR(VLOOKUP($I10,[1]【選択肢】!$Q$3:$U$90,4,),\" \")&IF(J10=\"\",\"\",\",\"&IFERROR(VLOOKUP($J10,[1]【選択肢】!$Q$3:$U$90,4,),\" \")&IF(K10=\"\",\"\",\",\"&IFERROR(VLOOKUP($K10,[1]【選択肢】!$Q$3:$U$90,4,),\" \")&IF(L10=\"\",\"\",\",\"&IFERROR(VLOOKUP($L10,[1]【選択肢】!$Q$3:$U$90,4,),\" \"))))))))","v":""},{"$f":"IF(G10=\"\",\"\",(IFERROR(VLOOKUP($G10,【選択肢】!$Q$3:$U$90,5,),\" \")&IF(H10=\"\",\"\",\",\"&IFERROR(VLOOKUP($H10,【選択肢】!$Q$3:$U$90,5,),\" \")&IF(I10=\"\",\"\",\",\"&IFERROR(VLOOKUP($I10,【選択肢】!$Q$3:$U$90,5,),\" \")&IF(J10=\"\",\"\",\",\"&IFERROR(VLOOKUP($J10,【選択肢】!$Q$3:$U$90,5,),\" \")&IF(K10=\"\",\"\",\",\"&IFERROR(VLOOKUP($K10,【選択肢】!$Q$3:$U$90,5,),\" \")&IF(L10=\"\",\"\",\",\"&IFERROR(VLOOKUP($L10,【選択肢】!$Q$3:$U$90,5,),\" \"))))))))","v":""}]
{"$rows_left_out":104}
{"sheet":"活動記録　記入例","index":1,"n_rows":35,"n_cols":18,"rows_kept":35,"cut":false,"hidden":false,"merged":[[30,1,30,15],[32,1,32,2],[3,6,3,14],[5,1,5,15],[6,1,6,2],[6,3,6,5],[6,6,8,11],[6,12,6,14],[6,15,8,15],[6,16,6,17],[7,1,8,1],[7,2,8,2],[7,3,8,3],[7,4,8,4],[7,5,8,5],[7,12,8,12],[7,13,8,13],[7,14,8,14],[7,16,8,16],[7,17,8,17],[33,1,33,2],[34,1,34,2],[39,1,41,1],[39,14,41,14],[39,15,41,15],[36,1,38,1],[36,14,38,14],[36,15,38,15],[42,1,44,1],[42,14,44,14],[42,15,44,15],[45,1,47,1],[45,14,47,14],[45,15,47,15],[48,1,50,1],[48,14,50,14],[48,15,50,15],[51,1,53,1],[51,14,53,14],[51,15,53,15],[54,1,56,1],[54,14,56,14],[54,15,56,15],[57,1,59,1],[57,14,59,14],[57,15,59,15],[60,1,62,1],[60,14,62,14],[60,15,62,15],[69,1,71,1],[69,14,71,14],[69,15,71,15],[63,1,65,1],[63,14,65,14],[63,15,65,15],[66,1,68,1],[66,14,68,14],[66,15,68,15]]}
[]
[null,"（様式第１－６号）",null,null,null,null,null,null,null,null,null,null,null,null,null,"農林水産省様式"]
[null,"【活動組織から市町村に提出するもの】",null,null,null,null,null,null,null,null,null,null,null,null,null,"組織名："]
[null,null,null,null,null,"令和７","年度　多面的機能支払交付金　活動記録",null,null,null,null,null,null,null,null,"○○保全協議会"]
[null,"★「実施時間」には休憩時間を含めず、実働時間を記入してください。"]
[null,"★「活動項目番号」欄には、実施要領別記1-2の国が定める活動指針における活動項目の番号及び要領第1の２の(1)に基づき都道府県が定める要綱基本方針において追加された活\n　動項目の番号を記入します。その他、事務処理は200番、会議等は300番を記入します。\n　同一日に複数の活動を行った場合は、該当する全ての活動項目番号を左詰めで一行に記入してください。番号欄が足りない場合は、複数行に分けて記入してください。"]
[null,"活動実施日及び活動時間",null,"活動参加人数",null,null,"活動項目番号（左詰め）",null,null,null,null,null,"活動内容",null,null,"備考\n（具体的な活動内容を記入）","様式欄外（参考）"]
[null,"日付","活動時間","農業者","農業者\n以外","総参加\n人数",null,null,null,null,null,null,"支払区分","活動区分","活動項目",null,"直営施工した場合は○","活動支援班による活動の場合は○"]
[]
[null,"2025-04-05",4,3,2,{"$f":"SUM(D10+E10)","v":5},1,24,25,26,27,null,{"$f":"IF(G10=\"\",\"\",(IFERROR(VLOOKUP($G10,【選択肢】!$Q$3:$U$90,2,),\" \")&IF(H10=\"\",\"\",\",\"&IFERROR(VLOOKUP($H10,【選択肢】!$Q$3:$U$90,2,),\" \")&IF(I10=\"\",\"\",\",\"&IFERROR(VLOOKUP($I10,【選択肢】!$Q$3:$U$90,2,),\" \")&IF(J10=\"\",\"\",\",\"&IFERROR(VLOOKUP($J10,【選択肢】!$Q$3:$U$90,2,),\" \")&IF(K10=\"\",\"\",\",\"&IFERROR(VLOOKUP($K10,【選択肢】!$Q$3:$U$90,2,),\" \")&IF(L10=\"\",\"\",\",\"&IFERROR(VLOOKUP($L10,【選択肢】!$Q$3:$U$90,2,),\" \"))))))))","v":"農地維持,共同,共同,共同,共同"},{"$f":"IF(G10=\"\",\"\",(IFERROR(VLOOKUP($G10,[1]【選択肢】!$Q$3:$U$90,4,),\" \")&IF(H10=\"\",\"\",\",\"&IFERROR(VLOOKUP($H10,[1]【選択肢】!$Q$3:$U$90,4,),\" \")&IF(I10=\"\",\"\",\",\"&IFERROR(VLOOKUP($I10,[1]【選択肢】!$Q$3:$U$90,4,),\" \")&IF(J10=\"\",\"\",\",\"&IFERROR(VLOOKUP($J10,[1]【選択肢】!$Q$3:$U$90,4,),\" \")&IF(K10=\"\",\"\",\",\"&IFERROR(VLOOKUP($K10,[1]【選択肢】!$Q$3:$U$90,4,),\" \")&IF(L10=\"\",\"\",\",\"&IFERROR(VLOOKUP($L10,[1]【選択肢】!$Q$3:$U$90,4,),\" \"))))))))","v":"点検,機能診断,機能診断,機能診断,機能診断"},{"$f":"IF(G10=\"\",\"\",(IFERROR(VLOOKUP($G10,【選択肢】!$Q$3:$U$90,5,),\" \")&IF(H10=\"\",\"\",\",\"&IFERROR(VLOOKUP($H10,【選択肢】!$Q$3:$U$90,5,),\" \")&IF(I10=\"\",\"\",\",\"&IFERROR(VLOOKUP($I10,【選択肢】!$Q$3:$U$90,5,),\" \")&IF(J10=\"\",\"\",\",\"&IFERROR(VLOOKUP($J10,【選択肢】!$Q$3:$U$90,5,),\" \")&IF(K10=\"\",\"\",\",\"&IFERROR(VLOOKUP($K10,【選択肢】!$Q$3:$U$90,5,),\" \")&IF(L10=\"\",\"\",\",\"&IFERROR(VLOOKUP($L10,【選択肢】!$Q$3:$U$90,5,),\" \"))))))))","v":"1 点検,24 農用地の機能診断,25 水路の機能診断,26 農道の機能診断,27 ため池の機能診断"},"各施設の点検、機能診断"]
{"$rows_left_out":26}
{"sheet":"活動実施項目一覧表","index":2,"n_rows":101,"n_cols":5,"rows_kept":101,"cut":false,"hidden":false,"merged":[[8,1,12,1],[8,3,8,4],[9,3,9,4],[10,3,10,4],[11,3,11,4],[12,3,12,4],[1,1,1,4],[2,3,2,4],[3,1,7,1],[3,3,3,4],[4,3,4,4],[5,3,5,4],[6,3,6,4],[7,3,7,4],[13,1,14,1],[13,3,14,3],[15,3,15,4],[17,1,17,4],[18,3,18,4],[19,1,21,1],[19,3,19,4],[20,2,21,2],[20,3,20,4],[21,3,21,4],[32,1,32,4],[33,3,33,4],[34,1,37,1],[34,3,34,4],[35,3,35,4],[36,3,36,4],[37,3,37,4],[23,1,23,4],[24,3,24,4],[25,3,25,4],[27,1,27,4],[28,3,28,4],[29,1,30,1],[29,2,30,2],[29,3,29,4],[30,3,30,4],[48,1,48,4],[49,3,49,4],[50,1,52,1],[50,3,50,4],[51,3,51,4],[52,3,52,4],[39,1,39,4],[40,3,40,4],[41,1,46,1],[41,3,41,4],[42,3,42,4],[43,3,43,4],[44,2,46,2],[44,3,44,4],[45,3,45,4],[46,3,46,4],[54,1,54,4],[55,3,55,4],[56,1,60,1],[56,3,56,4],[57,3,57,4],[58,3,58,4],[59,2,60,2],[59,3,59,4],[60,3,60,4],[78,3,78,4],[80,1,80,4],[69,1,69,4],[70,3,70,4],[71,1,72,1],[71,3,71,4],[72,3,72,4],[74,1,74,4],[62,1,62,4],[63,3,63,4],[64,1,67,1],[64,3,64,4],[65,3,65,4],[66,2,67,2],[66,3,66,4],[67,3,67,4],[98,1,98,4],[99,3,99,4],[100,3,100,4],[0,1,0,4],[87,3,87,4],[88,3,88,4],[90,1,90,4],[91,3,91,4],[92,3,92,4],[93,1,96,1],[93,3,93,4],[94,3,94,4],[95,3,95,4],[96,3,96,4],[81,3,81,4],[82,1,83,1],[82,3,82,4],[83,3,83,4],[85,1,85,4],[86,3,86,4],[75,3,75,4],[76,1,78,1],[76,3,76,4],[77,3,77,4]]}
[null,"活動実施項目一覧表【農地維持･資源向上(共同活動)】"]
[null,"共　　通"]
[null,"区分","番号","取組の内容"]
[null,"点検・\n機能診断",1,"耕作放棄地の把握、水路・農道・ため池施設の点検"]
[null,null,24,"農用地の機能診断・記録管理"]
[null,null,25,"水路の機能診断・記録管理"]
[null,null,26,"農道の機能診断・記録管理"]
[null,null,27,"ため池の機能診断・記録管理【対象施設として位置付けている組織のみ】"]
[null,"計画策定",2,"年度活動計画の策定（農地維持活動）"]
[null,null,28,"年度活動計画の策定（資源向上活動）"]
{"$rows_left_out":92}
{"sheet":"【選択肢】","index":3,"n_rows":245,"n_cols":25,"rows_kept":245,"cut":false,"hidden":true,"merged":[[16,2,16,6],[20,23,21,25],[0,0,0,13],[0,16,0,20],[0,21,1,21],[0,22,1,22],[1,5,1,9],[1,18,1,19]]}
[null,null,null,null,null,null,null,null,null,null,null,null,null,null,null,null,"活動記録で選択された取組番号から、区分、項目、取組を自動入力するための表",null,null,null,null,"実施回数のカウント","←活動記録に取組番号が入力された回数をカウントし、これをもとに実施状況報告書の「実施欄」の○、×を判定しています。","都道府県の要綱基本方針において取組を追加した場合の設定方法（県の担当者が作業してください）"]
["A.■か□","B.○か空白","C.○か－か×","D.農村環境保全活動のテーマ","E.高度な保全活動","F.施設（長寿命化）",null,null,null,null,"G.単位","H.構成員一覧の分類","I.金銭出納簿の区分","J.金銭出納簿の収支の分類",null,"プルダウン用","番号","支払区分","活動項目",null,"取組",null,null,"要綱基本方針において取組を追加した場合、以下の方法により修正することができます。"]
["■","○","○","生態系保全","循環かんがいによる水質保全","水路","61　水路の補修","62　水路の更新等",null,null,"km","１.農業者個人",1,"１.前年度持越",null,"○",200,"-","事務処理","事務処理","200 事務処理",null,null,"●共通：活動記録で、追加した取組番号を入力できるようにする"]
["□",null,"－","水質保全","浄化水路による水質保全","農道","63　農道の補修","64　農道の更新等",null,null,"箇所","２.農事組合法人",2,"２.交付金",null,"○",300,"-","会議","会議","300 会議",null,null,"　１）「取組番号早見表シート」及び「取組番号シート」に番号、支払区分、活動項目、取組を追加する。"]
[null,null,"×","景観形成・生活環境保全","地下水かん養","ため池","65　ため池の補修","66　ため池（附帯施設）の更新等",null,null,null,"３.営農組合",null,"３.利子等",null,null,null,null,null,null,null,null,null,"　２）「選択肢」シートのP列～T列の74行以降に行を挿入し、追加した取組番号、支払区分、活動項目、取組を入力する。"]
[null,null,null,"水田貯留・地下水かん養","持続的な水管理","生物多様性水路","108 生物多様性保全水路整備（排水路）（生態系保全）",null,null,null,null,"４.その他の農業者団体",null,"４.日当",null,{"$f":"'[1]別紙1 活動計画書'!M72","v":0},1,"農地維持","点検・計画策定","点検","1 点検",{"$f":"COUNTIF([1]活動記録!$G$9:$L$200,【選択肢】!Q6)","v":{"$error":"#VALUE!"}},null,"　３）「選択肢」シートU列の74行以降にU73セル（活動記録に入力された回数のカウントを行う数式）をコピーする。　"]
[null,null,null,"資源循環","土壌流出防止",null,null,null,null,null,null,"５.農業者以外個人",null,"５.外注費",null,{"$f":"'[1]別紙1 活動計画書'!M73","v":0},2,"農地維持","点検・計画策定","計画策定","2 年度活動計画の策定",{"$f":"COUNTIF([1]活動記録!$G$9:$L$200,【選択肢】!Q7)","v":{"$error":"#VALUE!"}},null,"　　　（この作業により、活動記録に取組番号が入力された回数がＰ列に入力され、これをもとに実施状況報告書の「実施欄」の○、×を判定します。）"]
[null,null,null,null,"生物多様性の回復",null,null,null,null,null,null,"６.自治会",null,"６.その他支出",null,"○",3,"農地維持","研修","研修","3 事務・組織運営等に関する研修、機械の安全使用に関する研修",{"$f":"COUNTIF([1]活動記録!$G$9:$L$200,【選択肢】!Q8)","v":{"$error":"#VALUE!"}}]
[null,null,null,null,"水環境の回復",null,null,null,null,null,null,"７.女性会",null,"７.返還",null,{"$f":"'[1]別紙1 活動計画書'!M75","v":0},4,"農地維持","実践活動","農用地","4 遊休農地発生防止のための保全管理",{"$f":"COUNTIF([1]活動記録!$G$9:$L$200,【選択肢】!Q9)","v":{"$error":"#VALUE!"}},null,"●農村環境保全活動、多面的機能の増進を図る活動、長寿命化のための活動を追加する場合は以下の設定を行う"]
[null,null,null,null,"持続的な畦畔管理",null,null,null,null,null,null,"８.子供会",null,null,null,{"$f":"'[1]別紙1 活動計画書'!M76","v":0},5,"農地維持","実践活動","農用地","5 畦畔・法面・防風林の草刈り",{"$f":"COUNTIF([1]活動記録!$G$9:$L$200,【選択肢】!Q10)","v":{"$error":"#VALUE!"}},null,"①農村環境保全活動の項目を追加する場合"]
{"$rows_left_out":235}